Target
Heparanase
Ligand
BDBM50179254
Substrate
Meas. Tech.
ChEMBL_325521 (CHEMBL860314)
IC50
1830±n/a nM
Citation
 Karoli, TLiu, LFairweather, JKHammond, ELi, CPCochran, SBergefall, KTrybala, EAddison, RSFerro, V Synthesis, biological activity, and preliminary pharmacokinetic evaluation of analogues of a phosphosulfomannan angiogenesis inhibitor (PI-88). J Med Chem 48:8229-36 (2005)  
Target
Name:
Heparanase
Synonyms:
Endo-glucoronidase HPA HPR1 HPSE1 HSE1 Heparanase 8 kDa subunit | Heparanase-1
Type:
PROTEIN
Mol. Mass.:
61167.67
Organism:
Homo sapiens (Human)
Description:
ChEMBL_327900
Residue:
543
  
Inhibitor
Name:
BDBM50179254
Synonyms:
(2R,3S,4S,5S,6R)-2-{[(2R,3S,4S,5R,6R)-2-{[(2R,3S,4S,5R,6R)-2-{[(2R,3S,4S,5R,6R)-2-{[(2S,3S,4S,5S,6R)-2-(benzyloxy)-4,5-dihydroxy-6-(hydroxymethyl)oxan-3-yl]oxy}-3,5-dihydroxy-6-(hydroxymethyl)oxan-4-yl]oxy}-3,5-dihydroxy-6-(hydroxymethyl)oxan-4-yl]oxy}-3,5-dihydroxy-6-(hydroxymethyl)oxan-4-yl]oxy}-6-(hydroxymethyl)oxane-3,4,5-triol | CHEMBL382044
Type:
Small organic molecule
Emp. Form.:
C37H58O26
Mol. Mass.:
918.8408
SMILES:
OC[C@H]1O[C@H](O[C@H]2[C@H](O)[C@@H](CO)O[C@H](O[C@H]3[C@H](O)[C@@H](CO)O[C@H](O[C@H]4[C@H](O)[C@@H](CO)O[C@H](O[C@H]5[C@@H](O)[C@H](O)[C@@H](CO)O[C@@H]5OCc5ccccc5)[C@H]4O)[C@H]3O)[C@H]2O)[C@@H](O)[C@@H](O)[C@@H]1O
: