Target
Tissue alpha-L-fucosidase
Ligand
BDBM50179480
Substrate
Meas. Tech.
ChEMBL_335897 (CHEMBL859282)
Ki
660000±n/a nM
Citation
 Dubernet, MDefoin, ATarnus, C Asymmetric synthesis of the L-fuco-nojirimycin, a nanomolar alpha-L-fucosidase inhibitor. Bioorg Med Chem Lett 16:1172-4 (2006)  
Target
Name:
Tissue alpha-L-fucosidase
Synonyms:
Alpha-L-fucosidase 1 FUCO_BOVIN
Type:
PROTEIN
Mol. Mass.:
54093.12
Organism:
Bos taurus
Description:
ChEMBL_335897
Residue:
468
  
Inhibitor
Name:
BDBM50179480
Synonyms:
(2R,3S,4R,5S)-2-methylpiperidine-3,4,5-triol | CHEMBL203959
Type:
Small organic molecule
Emp. Form.:
C6H13NO3
Mol. Mass.:
147.1723
SMILES:
C[C@H]1NC[C@H](O)[C@@H](O)[C@H]1O
: