Target
17-beta-hydroxysteroid dehydrogenase type 3
Ligand
BDBM50179964
Substrate
Meas. Tech.
ChEMBL_340361 (CHEMBL864402)
IC50
0.9±n/a nM
Citation
 Fink, BEGavai, AVTokarski, JSGoyal, BMisra, RXiao, HYKimball, SDHan, WCNorris, DSpires, TEYou, DGottardis, MMLorenzi, MVVite, GD Identification of a novel series of tetrahydrodibenzazocines as inhibitors of 17beta-hydroxysteroid dehydrogenase type 3. Bioorg Med Chem Lett 16:1532-6 (2006)  
Target
Name:
17-beta-hydroxysteroid dehydrogenase type 3
Synonyms:
17-beta-hydroxysteroid dehydrogenase type 3 EDH17B3 HSD17B3 | SDR12C2
Type:
Enzyme
Mol. Mass.:
34525.39
Organism:
Homo sapiens (Human)
Description:
P37058
Residue:
310
  
Inhibitor
Name:
BDBM50179964
Synonyms:
1-[2-chloro-8-(2-hydroxymethyl-phenyl)-11,12-dihydro-6H-dibenzo[b,f]azocin-5-yl]-ethanone | CHEMBL206405
Type:
Small organic molecule
Emp. Form.:
C24H22ClNO2
Mol. Mass.:
391.89
SMILES:
CC(=O)N1Cc2cc(ccc2CCc2cc(Cl)ccc12)-c1ccccc1CO
: