Target
Adenosine receptor A3
Ligand
BDBM50180229
Substrate
Meas. Tech.
ChEMBL_330118 (CHEMBL863398)
Ki
308±n/a nM
Citation
 Jeong, LSLee, HWJacobson, KAKim, HOShin, DHLee, JAGao, ZGLu, CDuong, HTGunaga, PLee, SKJin, DZChun, MWMoon, HR Structure-activity relationships of 2-chloro-N6-substituted-4'-thioadenosine-5'-uronamides as highly potent and selective agonists at the human A3 adenosine receptor. J Med Chem 49:273-81 (2006)  
Target
Name:
Adenosine receptor A3
Synonyms:
A3 adenosine receptor (hA3) ADORA3 | Adenosine A3 receptor (A3AR)
Type:
G Protein-Coupled Receptor (GPCR)
Mol. Mass.:
36197.32
Organism:
Homo sapiens (Human)
Description:
P0DMS8
Residue:
318
  
Inhibitor
Name:
BDBM50180229
Synonyms:
(2S,3S,4R,5R)-N-(3-chlorobenzyl)-5-(6-(3-iodobenzylamino)-2-chloro-9H-purin-9-yl)-3,4-dihydroxy-tetrahydrothiophene-2-carboxamide | CHEMBL199414
Type:
Small organic molecule
Emp. Form.:
C24H21Cl2IN6O3S
Mol. Mass.:
671.337
SMILES:
O[C@H]1[C@@H](O)[C@@H](S[C@@H]1C(=O)NCc1cccc(Cl)c1)n1cnc2c(NCc3cccc(I)c3)nc(Cl)nc12
: