Target
5-hydroxytryptamine receptor 2B
Ligand
BDBM50180256
Substrate
Meas. Tech.
ChEMBL_329317 (CHEMBL863540)
EC50
85±n/a nM
Citation
 May, JADantanarayana, APZinke, PWMcLaughlin, MASharif, NA 1-((S)-2-aminopropyl)-1H-indazol-6-ol: a potent peripherally acting 5-HT2 receptor agonist with ocular hypotensive activity. J Med Chem 49:318-28 (2006)  
Target
Name:
5-hydroxytryptamine receptor 2B
Synonyms:
5-HT2B 5HT2B_RAT Serotonin 2b (5-HT2b) receptor Srl
Type:
Enzyme Catalytic Domain
Mol. Mass.:
53668.47
Organism:
RAT
Description:
5-HT2B HTR2B RAT::P30994
Residue:
479
  
Inhibitor
Name:
BDBM50180256
Synonyms:
1-((R)-2-aminopropyl)-1H-indazol-6-ol | CHEMBL437314
Type:
Small organic molecule
Emp. Form.:
C10H13N3O
Mol. Mass.:
191.2297
SMILES:
C[C@@H](N)Cn1ncc2ccc(O)cc12
: