Target
D(3) dopamine receptor
Ligand
BDBM50181161
Substrate
Meas. Tech.
ChEMBL_346082 (CHEMBL862318)
Ki
0.9±n/a nM
Citation
 Geneste, HAmberg, WBackfisch, GBeyerbach, ABraje, WMDelzer, JHaupt, AHutchins, CWKing, LLSauer, DRUnger, LWernet, W Synthesis and SAR of highly potent and selective dopamine D3-receptor antagonists: variations on the 1H-pyrimidin-2-one theme. Bioorg Med Chem Lett 16:1934-7 (2006)  
Target
Name:
D(3) dopamine receptor
Synonyms:
DOPAMINE D3 DRD3_HUMAN Dopamine D3 receptor (D3) Dopamine receptor Dopamine receptor D3
Type:
Mol. Mass.:
44243.43
Organism:
Homo sapiens (Human)
Description:
Residue:
400
  
Inhibitor
Name:
BDBM50181161
Synonyms:
3-(4-(4-(2-tert-butyl-6-(trifluoromethyl)pyrimidin-4-yl)piperazin-1-yl)butyl)-1,1-diethylurea | CHEMBL202858
Type:
Small organic molecule
Emp. Form.:
C22H37F3N6O
Mol. Mass.:
458.564
SMILES:
CCN(CC)C(=O)NCCCCN1CCN(CC1)c1cc(nc(n1)C(C)(C)C)C(F)(F)F
: