Target
D(2) dopamine receptor
Ligand
BDBM50181164
Substrate
Meas. Tech.
ChEMBL_346083 (CHEMBL862319)
Ki
25.5±n/a nM
Citation
 Geneste, HAmberg, WBackfisch, GBeyerbach, ABraje, WMDelzer, JHaupt, AHutchins, CWKing, LLSauer, DRUnger, LWernet, W Synthesis and SAR of highly potent and selective dopamine D3-receptor antagonists: variations on the 1H-pyrimidin-2-one theme. Bioorg Med Chem Lett 16:1934-7 (2006)  
Target
Name:
D(2) dopamine receptor
Synonyms:
D(2) dopamine receptor DOPAMINE D2 Long DRD2 Dopamine D2 receptor Dopamine D2 receptor (D2R) Dopamine2-like | d2
Type:
Cell-surface receptors
Mol. Mass.:
50647.10
Organism:
Homo sapiens (Human)
Description:
P14416
Residue:
443
  
Inhibitor
Name:
BDBM50181164
Synonyms:
1-(4-(4-(2-tert-butyl-6-(trifluoromethyl)pyrimidin-4-yl)piperazin-1-yl)butyl)-4-hydroxypyridin-2(1H)-one | CHEMBL202670
Type:
Small organic molecule
Emp. Form.:
C22H30F3N5O2
Mol. Mass.:
453.5011
SMILES:
CC(C)(C)c1nc(cc(n1)C(F)(F)F)N1CCN(CCCCn2ccc(O)cc2=O)CC1
: