Target
RNA-directed RNA polymerase
Ligand
BDBM50181707
Substrate
Meas. Tech.
ChEMBL_331786 (CHEMBL864669)
IC50
3000±n/a nM
Citation
 Powers, JPPiper, DELi, YMayorga, VAnzola, JChen, JMJaen, JCLee, GLiu, JPeterson, MGTonn, GRYe, QWalker, NPWang, Z SAR and mode of action of novel non-nucleoside inhibitors of hepatitis C NS5b RNA polymerase. J Med Chem 49:1034-46 (2006)  
Target
Name:
RNA-directed RNA polymerase
Synonyms:
Hepatitis C virus NS5B RNA-dependent RNA polymerase | NS5B protein
Type:
Protein
Mol. Mass.:
25173.95
Organism:
Hepatitis C virus
Description:
Q8JXU8
Residue:
229
  
Inhibitor
Name:
BDBM50181707
Synonyms:
5-(2-naphthylmethylene)-3-(benzenesulfonylamino)-4-oxo-2-thionothiazolidine | CHEMBL371882
Type:
Small organic molecule
Emp. Form.:
C20H14N2O3S3
Mol. Mass.:
426.532
SMILES:
O=C1N(NS(=O)(=O)c2ccccc2)C(=S)SC1=Cc1ccc2ccccc2c1
: