Target
RNA-directed RNA polymerase
Ligand
BDBM50181715
Substrate
Meas. Tech.
ChEMBL_331786 (CHEMBL864669)
IC50
6000±n/a nM
Citation
 Powers, JPPiper, DELi, YMayorga, VAnzola, JChen, JMJaen, JCLee, GLiu, JPeterson, MGTonn, GRYe, QWalker, NPWang, Z SAR and mode of action of novel non-nucleoside inhibitors of hepatitis C NS5b RNA polymerase. J Med Chem 49:1034-46 (2006)  
Target
Name:
RNA-directed RNA polymerase
Synonyms:
Hepatitis C virus NS5B RNA-dependent RNA polymerase | NS5B protein
Type:
Protein
Mol. Mass.:
25173.95
Organism:
Hepatitis C virus
Description:
Q8JXU8
Residue:
229
  
Inhibitor
Name:
BDBM50181715
Synonyms:
5-(3,4-dichlorobenzylidene)-3-(4-methoxybenzenesulfonylamino)-4-oxo-2-thionothiazolidine | CHEMBL201797
Type:
Small organic molecule
Emp. Form.:
C17H14Cl2N2O4S3
Mol. Mass.:
477.405
SMILES:
COc1ccc(cc1)S(=O)(=O)NN1C(O)\C(SC1=S)=C\c1ccc(Cl)c(Cl)c1
: