Target
RNA-directed RNA polymerase
Ligand
BDBM50181691
Substrate
Meas. Tech.
ChEMBL_331786 (CHEMBL864669)
IC50
6500±n/a nM
Citation
 Powers, JPPiper, DELi, YMayorga, VAnzola, JChen, JMJaen, JCLee, GLiu, JPeterson, MGTonn, GRYe, QWalker, NPWang, Z SAR and mode of action of novel non-nucleoside inhibitors of hepatitis C NS5b RNA polymerase. J Med Chem 49:1034-46 (2006)  
Target
Name:
RNA-directed RNA polymerase
Synonyms:
Hepatitis C virus NS5B RNA-dependent RNA polymerase | NS5B protein
Type:
Protein
Mol. Mass.:
25173.95
Organism:
Hepatitis C virus
Description:
Q8JXU8
Residue:
229
  
Inhibitor
Name:
BDBM50181691
Synonyms:
5-(2-fluorobenzylidene)-3-(benzenesulfonylamino)-4-oxo-2-thionothiazolidine | CHEMBL435117
Type:
Small organic molecule
Emp. Form.:
C16H11FN2O3S3
Mol. Mass.:
394.464
SMILES:
Fc1ccccc1C=C1SC(=S)N(NS(=O)(=O)c2ccccc2)C1=O
: