Target
Metabotropic glutamate receptor 5
Ligand
BDBM50181737
Substrate
Meas. Tech.
ChEMBL_331630 (CHEMBL864050)
IC50
>10000±n/a nM
Citation
 Iso, YGrajkowska, EWroblewski, JTDavis, JGoeders, NEJohnson, KMSanker, SRoth, BLTueckmantel, WKozikowski, AP Synthesis and structure-activity relationships of 3-[(2-methyl-1,3-thiazol-4-yl)ethynyl]pyridine analogues as potent, noncompetitive metabotropic glutamate receptor subtype 5 antagonists; search for cocaine medications. J Med Chem 49:1080-100 (2006)  
Target
Name:
Metabotropic glutamate receptor 5
Synonyms:
GPRC1E GRM5_HUMAN metabotropic glutamate 5 | metabotropic glutamate 5a
Type:
Enzyme
Mol. Mass.:
132484.72
Organism:
Homo sapiens (Human)
Description:
Residue:
1212
  
Inhibitor
Name:
BDBM50181737
Synonyms:
CHEMBL202041 | N-[4-(3-pyridylethynyl)-2-thiazolyl]benzamide
Type:
Small organic molecule
Emp. Form.:
C17H13N3S
Mol. Mass.:
291.37
SMILES:
C(Nc1nc(cs1)C#Cc1cccnc1)c1ccccc1
: