Target
Cathepsin S
Ligand
BDBM50182099
Substrate
Meas. Tech.
ChEMBL_347359 (CHEMBL865648)
IC50
33±n/a nM
Citation
 Grice, CATays, KKhatuya, HGustin, DJButler, CRWei, JSehon, CASun, SGu, YJiang, WThurmond, RLKarlsson, LEdwards, JP The SAR of 4-substituted (6,6-bicyclic) piperidine cathepsin S inhibitors. Bioorg Med Chem Lett 16:2209-12 (2006)  
Target
Name:
Cathepsin S
Synonyms:
CATS_HUMAN Cathepsin S (Cat S) | cathepsin S preproprotein
Type:
Protein
Mol. Mass.:
37507.38
Organism:
Homo sapiens (Human)
Description:
P25774
Residue:
331
  
Inhibitor
Name:
BDBM50182099
Synonyms:
1-(1-(3-(3-(4-bromophenyl)-5-(methylsulfonyl)-4,5,6,7-tetrahydropyrazolo[4,3-c]pyridin-1-yl)-2-hydroxypropyl)piperidin-4-yl)-6-chloro-3,4-dihydroquinazolin-2(1H)-one | CHEMBL206035
Type:
Small organic molecule
Emp. Form.:
C29H34BrClN6O4S
Mol. Mass.:
678.04
SMILES:
CS(=O)(=O)N1CCc2c(C1)c(nn2CC(O)CN1CCC(CC1)N1C(=O)NCc2cc(Cl)ccc12)-c1ccc(Br)cc1
: