Target
HLA class II histocompatibility antigen gamma chain
Ligand
BDBM50182109
Substrate
Meas. Tech.
ChEMBL_347360 (CHEMBL865649)
IC50
1800±n/a nM
Citation
 Grice, CATays, KKhatuya, HGustin, DJButler, CRWei, JSehon, CASun, SGu, YJiang, WThurmond, RLKarlsson, LEdwards, JP The SAR of 4-substituted (6,6-bicyclic) piperidine cathepsin S inhibitors. Bioorg Med Chem Lett 16:2209-12 (2006)  
Target
Name:
HLA class II histocompatibility antigen gamma chain
Synonyms:
CD74 HG2A_HUMAN | HLA-DR antigens-associated invariant chain
Type:
PROTEIN
Mol. Mass.:
33525.85
Organism:
Homo sapiens (Human)
Description:
ChEMBL_347360
Residue:
296
  
Inhibitor
Name:
BDBM50182109
Synonyms:
1-(1-(2-hydroxy-3-(5-(methylsulfonyl)-3-(4-(trifluoromethyl)phenyl)-4,5,6,7-tetrahydropyrazolo[4,3-c]pyridin-1-yl)propyl)piperidin-4-yl)-3,4-dihydroquinolin-2(1H)-one | CHEMBL379769
Type:
Small organic molecule
Emp. Form.:
C31H36F3N5O4S
Mol. Mass.:
631.709
SMILES:
CS(=O)(=O)N1CCc2c(C1)c(nn2CC(O)CN1CCC(CC1)N1C(=O)CCc2ccccc12)-c1ccc(cc1)C(F)(F)F
: