Target
HLA class II histocompatibility antigen gamma chain
Ligand
BDBM50182110
Substrate
Meas. Tech.
ChEMBL_347360 (CHEMBL865649)
IC50
950±n/a nM
Citation
 Grice, CATays, KKhatuya, HGustin, DJButler, CRWei, JSehon, CASun, SGu, YJiang, WThurmond, RLKarlsson, LEdwards, JP The SAR of 4-substituted (6,6-bicyclic) piperidine cathepsin S inhibitors. Bioorg Med Chem Lett 16:2209-12 (2006)  
Target
Name:
HLA class II histocompatibility antigen gamma chain
Synonyms:
CD74 HG2A_HUMAN | HLA-DR antigens-associated invariant chain
Type:
PROTEIN
Mol. Mass.:
33525.85
Organism:
Homo sapiens (Human)
Description:
ChEMBL_347360
Residue:
296
  
Inhibitor
Name:
BDBM50182110
Synonyms:
4-(1-(3-(5-(methylsulfonyl)-3-(4-(trifluoromethyl)phenyl)-4,5,6,7-tetrahydropyrazolo[4,3-c]pyridin-1-yl)propyl)piperidin-4-yl)-2H-benzo[b][1,4]oxazin-3(4H)-one | CHEMBL204525
Type:
Small organic molecule
Emp. Form.:
C30H34F3N5O4S
Mol. Mass.:
617.682
SMILES:
CS(=O)(=O)N1CCc2c(C1)c(nn2CCCN1CCC(CC1)N1C(=O)COc2ccccc12)-c1ccc(cc1)C(F)(F)F
: