Target
Complement C1s subcomponent
Ligand
BDBM50182159
Substrate
Meas. Tech.
ChEBML_347235
Ki
40±n/a nM
Citation
 Subasinghe, NLTravins, JMAli, FHuang, HBallentine, SKMarugán, JJKhalil, EHufnagel, HRBone, RFDesJarlais, RLCrysler, CSNinan, NCummings, MDMolloy, CJTomczuk, BE A novel series of arylsulfonylthiophene-2-carboxamidine inhibitors of the complement component C1s. Bioorg Med Chem Lett 16:2200-4 (2006)  
Target
Name:
Complement C1s subcomponent
Synonyms:
C1 esterase C1S_HUMAN Complement C1s subcomponent Complement C1s subcomponent light chain Trypsin | complement component 1, s subcomponent
Type:
Protein
Mol. Mass.:
76657.91
Organism:
Homo sapiens (Human)
Description:
P09871
Residue:
688
  
Inhibitor
Name:
BDBM50182159
Synonyms:
4-[7-bromo-1-(2,6-difluoro-benzyl)-1H-benzoimidazole-5-sulfonyl]-5-methylsulfanyl-thiophene-2-carboxamidine | CHEMBL382350
Type:
Small organic molecule
Emp. Form.:
C20H15BrF2N4O2S3
Mol. Mass.:
557.455
SMILES:
CSc1sc(cc1S(=O)(=O)c1cc(Br)c2n(Cc3c(F)cccc3F)cnc2c1)C(N)=N
: