Target
Beta-glucosidase
Ligand
BDBM50182801
Substrate
Meas. Tech.
ChEMBL_344324 (CHEMBL867768)
Ki
7±n/a nM
Citation
 Greimel, PHäusler, HLundt, IRupitz, KStütz, AETarling, CAWithers, SGWrodnigg, TM Fluorescent glycosidase inhibiting 1,5-dideoxy-1,5-iminoalditols. Bioorg Med Chem Lett 16:2067-70 (2006)  
Target
Name:
Beta-glucosidase
Synonyms:
BGLS_RHIRD | cbg-1
Type:
PROTEIN
Mol. Mass.:
88266.88
Organism:
Agrobacterium tumefaciens
Description:
ChEMBL_1366789
Residue:
818
  
Inhibitor
Name:
BDBM50182801
Synonyms:
(3R,4R,5R)-5-(Hydroxymethyl)piperidine-3,4-diol, 8 5-HYDROXYMETHYL-3,4-DIHYDROXYPIPERIDINE CHEMBL206468 US10081601, Example 1.1 isofagomine
Type:
Small organic molecule
Emp. Form.:
C6H13NO3
Mol. Mass.:
147.1723
SMILES:
OC[C@H]1CNC[C@@H](O)[C@@H]1O
: