Target
Mu-type opioid receptor
Ligand
BDBM50154041
Substrate
Meas. Tech.
ChEMBL_349389 (CHEMBL865710)
EC50
142±n/a nM
Citation
 Breslin, HJCai, CMiskowski, TACoutinho, SVZhang, SPHornby, PHe, W Identification of potent phenyl imidazoles as opioid receptor agonists. Bioorg Med Chem Lett 16:2505-8 (2006)  
Target
Name:
Mu-type opioid receptor
Synonyms:
M-OR-1 Mu opioid receptor OPIATE Mu OPRM_CAVPO
Type:
Enzyme Catalytic Domain
Mol. Mass.:
11165.58
Organism:
GUINEA PIG
Description:
P97266
Residue:
98
  
Inhibitor
Name:
BDBM50154041
Synonyms:
(S)-2-amino-3-(4-hydroxyphenyl)-1-((S)-2-(5-methyl-4-phenyl-1H-imidazol-2-yl)piperidin-1-yl)propan-1-one CHEMBL366311
Type:
Small organic molecule
Emp. Form.:
C24H28N4O2
Mol. Mass.:
404.5047
SMILES:
Cc1[nH]c(nc1-c1ccccc1)[C@@H]1CCCCN1C(=O)[C@@H](N)Cc1ccc(O)cc1
: