Target
cAMP-specific 3',5'-cyclic phosphodiesterase 4A
Ligand
BDBM50183792
Substrate
Meas. Tech.
ChEMBL_353740 (CHEMBL866234)
IC50
0.1±n/a nM
Citation
 Lacombe, PDeschênes, DDubé, DDubé, LGallant, MMacdonald, DMastracchio, APerrier, HCharleson, SHuang, ZLaliberté, FLiu, SMancini, JAMasson, PSalem, MStyhler, AGirard, Y Nitrogen-bridged substituted 8-arylquinolines as potent PDE IV inhibitors. Bioorg Med Chem Lett 16:2608-12 (2006)  
Target
Name:
cAMP-specific 3',5'-cyclic phosphodiesterase 4A
Synonyms:
3',5'-cyclic phosphodiesterase PDE46 PDE4A_HUMAN Phosphodiesterase 4A | Phosphodiesterase 4A (PDE4)
Type:
Enzyme
Mol. Mass.:
98113.27
Organism:
Homo sapiens (Human)
Description:
P27815
Residue:
886
  
Inhibitor
Name:
BDBM50183792
Synonyms:
1-((3-(6-(2-cyanopropan-2-yl)quinolin-8-yl)phenyl)methyl)-3-isopropyl-1-(4-(methylsulfonyl)phenyl)urea | CHEMBL382168
Type:
Small organic molecule
Emp. Form.:
C31H32N4O3S
Mol. Mass.:
540.676
SMILES:
CC(C)NC(=O)N(Cc1cccc(c1)-c1cc(cc2cccnc12)C(C)(C)C#N)c1ccc(cc1)S(C)(=O)=O
: