Target
cAMP-specific 3',5'-cyclic phosphodiesterase 4D
Ligand
BDBM50183795
Substrate
Meas. Tech.
ChEMBL_353751 (CHEMBL866914)
IC50
0.5±n/a nM
Citation
 Lacombe, PDeschênes, DDubé, DDubé, LGallant, MMacdonald, DMastracchio, APerrier, HCharleson, SHuang, ZLaliberté, FLiu, SMancini, JAMasson, PSalem, MStyhler, AGirard, Y Nitrogen-bridged substituted 8-arylquinolines as potent PDE IV inhibitors. Bioorg Med Chem Lett 16:2608-12 (2006)  
Target
Name:
cAMP-specific 3',5'-cyclic phosphodiesterase 4D
Synonyms:
3',5'-cyclic phosphodiesterase PDE43 PDE4D_HUMAN | Phosphodiesterase 4D
Type:
Protein
Mol. Mass.:
91092.69
Organism:
Homo sapiens (Human)
Description:
Q08499
Residue:
809
  
Inhibitor
Name:
BDBM50183795
Synonyms:
2-(8-(3-(((4-fluorobenzyl)(4-(methylsulfonyl)phenyl)amino)methyl)phenyl)quinolin-6-yl)-2-methylpropanenitrile | CHEMBL378681
Type:
Small organic molecule
Emp. Form.:
C34H30FN3O2S
Mol. Mass.:
563.684
SMILES:
CC(C)(C#N)c1cc(-c2cccc(CN(Cc3ccc(F)cc3)c3ccc(cc3)S(C)(=O)=O)c2)c2ncccc2c1
: