Target
Thromboxane A2 receptor
Ligand
BDBM50184233
Substrate
Meas. Tech.
ChEMBL_364758 (CHEMBL871220)
Ki
2100±n/a nM
Citation
 Sturino, CFLachance, NBoyd, MBerthelette, CLabelle, MLi, LRoy, BScheigetz, JTsou, NBrideau, CCauchon, ECarriere, MCDenis, DGreig, GKargman, SLamontagne, SMathieu, MCSawyer, NSlipetz, DO'Neill, GWang, ZZamboni, RMetters, KMYoung, RN Identification of an indole series of prostaglandin D2 receptor antagonists. Bioorg Med Chem Lett 16:3043-8 (2006)  
Target
Name:
Thromboxane A2 receptor
Synonyms:
Prostanoid TP receptor TBXA2R Thromboxane Thromboxane Beta
Type:
Enyzme
Mol. Mass.:
37445.28
Organism:
Homo sapiens (Human)
Description:
P21731
Residue:
343
  
Inhibitor
Name:
BDBM50184233
Synonyms:
2-(4-(4-chlorobenzyl)-7-(methylsulfonyl)-1,2,3,4-tetrahydrocyclopenta[b]indol-3-yl)acetic acid | CHEMBL207104
Type:
Small organic molecule
Emp. Form.:
C21H20ClNO4S
Mol. Mass.:
417.906
SMILES:
CS(=O)(=O)c1ccc2n(Cc3ccc(Cl)cc3)c3C(CC(O)=O)CCc3c2c1
: