Target
Cytosolic phospholipase A2
Ligand
BDBM50184559
Substrate
Meas. Tech.
ChEMBL_365214 (CHEMBL862421)
IC50
>50000±n/a nM
Citation
 Gopalsamy, AYang, HEllingboe, JWMcKew, JCTam, SJoseph-McCarthy, DZhang, WShen, MClark, JD 1,2,4-Oxadiazolidin-3,5-diones and 1,3,5-triazin-2,4,6-triones as cytosolic phospholipase A2alpha inhibitors. Bioorg Med Chem Lett 16:2978-81 (2006)  
Target
Name:
Cytosolic phospholipase A2
Synonyms:
CPLA2 PA24A_HUMAN PLA2G4A Phospholipase A2 | Phospholipase A2 group IVA
Type:
Protein
Mol. Mass.:
85219.30
Organism:
Homo sapiens (Human)
Description:
P47712
Residue:
749
  
Inhibitor
Name:
BDBM50184559
Synonyms:
4-(4-(2-(2,2-diphenylethyl)-3,5-dioxo-1,2,4-oxadiazolidin-4-yl)butoxy)benzoic acid | CHEMBL210197
Type:
Small organic molecule
Emp. Form.:
C27H26N2O6
Mol. Mass.:
474.5051
SMILES:
OC(=O)c1ccc(OCCCCn2c(=O)on(CC(c3ccccc3)c3ccccc3)c2=O)cc1
: