Target
Cytosolic phospholipase A2
Ligand
BDBM50180057
Substrate
Meas. Tech.
ChEMBL_365214 (CHEMBL862421)
IC50
3000±n/a nM
Citation
 Gopalsamy, AYang, HEllingboe, JWMcKew, JCTam, SJoseph-McCarthy, DZhang, WShen, MClark, JD 1,2,4-Oxadiazolidin-3,5-diones and 1,3,5-triazin-2,4,6-triones as cytosolic phospholipase A2alpha inhibitors. Bioorg Med Chem Lett 16:2978-81 (2006)  
Target
Name:
Cytosolic phospholipase A2
Synonyms:
CPLA2 PA24A_HUMAN PLA2G4A Phospholipase A2 | Phospholipase A2 group IVA
Type:
Protein
Mol. Mass.:
85219.30
Organism:
Homo sapiens (Human)
Description:
P47712
Residue:
749
  
Inhibitor
Name:
BDBM50180057
Synonyms:
4-(2-(1-benzhydryl-2-methyl-1H-indol-3-yl)ethoxy)benzoic acid 4-[2-[5-chloro-1-(diphenylmethyl)-2-methyl-1H-indol-3-yl]ethoxy]benzoic acid | CHEMBL371226
Type:
Small organic molecule
Emp. Form.:
C31H26ClNO3
Mol. Mass.:
495.996
SMILES:
Cc1c(CCOc2ccc(cc2)C(O)=O)c2cc(Cl)ccc2n1C(c1ccccc1)c1ccccc1
: