Target
D(4) dopamine receptor
Ligand
BDBM50184800
Substrate
Meas. Tech.
ChEMBL_357154 (CHEMBL853173)
Ki
1±n/a nM
Citation
 Löber, SHübner, HGmeiner, P Synthesis and biological investigations of dopaminergic partial agonists preferentially recognizing the D4 receptor subtype. Bioorg Med Chem Lett 16:2955-9 (2006)  
Target
Name:
D(4) dopamine receptor
Synonyms:
D(2C) dopamine receptor DOPAMINE D4.2 DRD4 Dopamine D4 receptor
Type:
Enzyme
Mol. Mass.:
48373.19
Organism:
Homo sapiens (Human)
Description:
P21917
Residue:
419
  
Inhibitor
Name:
BDBM50184800
Synonyms:
1-Phenyl-4-[(1-phenyl-1H-pyrazol-4-yl)methyl]piperazine CHEMBL210405
Type:
Small organic molecule
Emp. Form.:
C20H22N4
Mol. Mass.:
318.4155
SMILES:
C(N1CCN(CC1)c1ccccc1)c1cnn(c1)-c1ccccc1
: