Target
Cytosolic phospholipase A2
Ligand
BDBM50185354
Substrate
Meas. Tech.
ChEMBL_341910 (CHEMBL863833)
IC50
0.900000±n/a nM
Citation
 Ludwig, JBovens, SBrauch, CElfringhoff, ASLehr, M Design and synthesis of 1-indol-1-yl-propan-2-ones as inhibitors of human cytosolic phospholipase A2alpha. J Med Chem 49:2611-20 (2006)  
Target
Name:
Cytosolic phospholipase A2
Synonyms:
CPLA2 PA24A_HUMAN PLA2G4A Phospholipase A2 | Phospholipase A2 group IVA
Type:
Protein
Mol. Mass.:
85219.30
Organism:
Homo sapiens (Human)
Description:
P47712
Residue:
749
  
Inhibitor
Name:
BDBM50185354
Synonyms:
3-methylhydrogen 1-[3-(4-decyloxyphenoxy)-2-oxopropyl]indole-3,5-dicarboxylate | CHEMBL443834
Type:
Small organic molecule
Emp. Form.:
C30H37NO7
Mol. Mass.:
523.6173
SMILES:
CCCCCCCCCCOc1ccc(OCC(=O)Cn2cc(C(=O)OC)c3cc(ccc23)C(O)=O)cc1
: