Target
Glutathione reductase, mitochondrial
Ligand
BDBM50185391
Substrate
Meas. Tech.
ChEMBL_360715 (CHEMBL869332)
IC50
>100000±n/a nM
Citation
 Bi, XLopez, CBacchi, CJRattendi, DWoster, PM Novel alkylpolyaminoguanidines and alkylpolyaminobiguanides with potent antitrypanosomal activity. Bioorg Med Chem Lett 16:3229-32 (2006)  
Target
Name:
Glutathione reductase, mitochondrial
Synonyms:
GLUR GSHR_HUMAN Glutathione reductase | Glutathione reductase (GR)
Type:
Enzyme
Mol. Mass.:
56271.52
Organism:
Homo sapiens (Human)
Description:
P00390
Residue:
522
  
Inhibitor
Name:
BDBM50185391
Synonyms:
CHEMBL439520 | N-benzyl-N'-(3-{7-[3-(N'-benzyl-guanidino)-propylamino]-heptylamino}-propyl)-guanidine
Type:
Small organic molecule
Emp. Form.:
C29H48N8
Mol. Mass.:
508.745
SMILES:
NC(NCc1ccccc1)=NCCCNCCCCCCCNCCCN=C(N)NCc1ccccc1
: