Target
Trypanothione reductase
Ligand
BDBM50185391
Substrate
Meas. Tech.
ChEMBL_360714 (CHEMBL869331)
IC50
69470±n/a nM
Citation
 Bi, XLopez, CBacchi, CJRattendi, DWoster, PM Novel alkylpolyaminoguanidines and alkylpolyaminobiguanides with potent antitrypanosomal activity. Bioorg Med Chem Lett 16:3229-32 (2006)  
Target
Name:
Trypanothione reductase
Synonyms:
N(1),N(8)-bis(glutathionyl)spermidine reductase TR | TYTR_TRYCR
Type:
Homodimer; oxidoreductase
Mol. Mass.:
53868.26
Organism:
Trypanosoma cruzi
Description:
Residue:
492
  
Inhibitor
Name:
BDBM50185391
Synonyms:
CHEMBL439520 | N-benzyl-N'-(3-{7-[3-(N'-benzyl-guanidino)-propylamino]-heptylamino}-propyl)-guanidine
Type:
Small organic molecule
Emp. Form.:
C29H48N8
Mol. Mass.:
508.745
SMILES:
NC(NCc1ccccc1)=NCCCNCCCCCCCNCCCN=C(N)NCc1ccccc1
: