Target
Trypanothione reductase
Ligand
BDBM50185390
Substrate
Meas. Tech.
ChEMBL_360714 (CHEMBL869331)
IC50
4160±n/a nM
Citation
 Bi, XLopez, CBacchi, CJRattendi, DWoster, PM Novel alkylpolyaminoguanidines and alkylpolyaminobiguanides with potent antitrypanosomal activity. Bioorg Med Chem Lett 16:3229-32 (2006)  
Target
Name:
Trypanothione reductase
Synonyms:
N(1),N(8)-bis(glutathionyl)spermidine reductase TR | TYTR_TRYCR
Type:
Homodimer; oxidoreductase
Mol. Mass.:
53868.26
Organism:
Trypanosoma cruzi
Description:
Residue:
492
  
Inhibitor
Name:
BDBM50185390
Synonyms:
CHEMBL209834 | N-(2,2-diphenylethyl)-1-3-[3-({3-[(3-{N-[3-(2,2-diphenylethyl)carbamimidamidomethanimidoyl]amino}propyl)amino]propyl}amino)propyl]carbamimidamidomethanimidamide
Type:
Small organic molecule
Emp. Form.:
C41H56N12
Mol. Mass.:
716.9637
SMILES:
NC(NC(=N)NCC(c1ccccc1)c1ccccc1)=NCCCNCCCNCCCN=C(N)NC(=N)NCC(c1ccccc1)c1ccccc1
: