Target
Trypanothione reductase
Ligand
BDBM50185401
Substrate
Meas. Tech.
ChEMBL_360714 (CHEMBL869331)
IC50
3600±n/a nM
Citation
 Bi, XLopez, CBacchi, CJRattendi, DWoster, PM Novel alkylpolyaminoguanidines and alkylpolyaminobiguanides with potent antitrypanosomal activity. Bioorg Med Chem Lett 16:3229-32 (2006)  
Target
Name:
Trypanothione reductase
Synonyms:
N(1),N(8)-bis(glutathionyl)spermidine reductase TR | TYTR_TRYCR
Type:
Homodimer; oxidoreductase
Mol. Mass.:
53868.26
Organism:
Trypanosoma cruzi
Description:
Residue:
492
  
Inhibitor
Name:
BDBM50185401
Synonyms:
CHEMBL207163 | N-(2,2-diphenyl-ethyl)-N'-[3-(3-{3-[N'-(2,2-diphenyl-ethyl)-guanidino]-propylamino}-propylamino)-propyl]-guanidine
Type:
Small organic molecule
Emp. Form.:
C39H52N8
Mol. Mass.:
632.8838
SMILES:
NC(NCC(c1ccccc1)c1ccccc1)=NCCCNCCCNCCCN=C(N)NCC(c1ccccc1)c1ccccc1
: