Target
Potassium voltage-gated channel subfamily H member 2
Ligand
BDBM50185775
Substrate
Meas. Tech.
ChEMBL_361717 (CHEMBL861449)
Ki
1268±n/a nM
Citation
 Ladduwahetty, TBoase, ALMitchinson, AQuin, CPatel, SChapman, KMacLeod, AM A new class of selective, non-basic 5-HT2A receptor antagonists. Bioorg Med Chem Lett 16:3201-4 (2006)  
Target
Name:
Potassium voltage-gated channel subfamily H member 2
Synonyms:
1,3-beta-glucan synthase component GLS2 ERG Eag-related protein 1 Ether-a-go-go-related gene (HERG) Ether-a-go-go-related gene potassium channel 1 Ether-a-go-go-related gene potassium channel 1 (hERG1) Ether-a-go-go-related protein 1 H-ERG KCNH2 Potassium voltage-gated channel subfamily H member 2 (hERG) Voltage-gated potassium channel subunit Kv11.1 hERG Potassium Channel 1 | putative potassium channel subunit
Type:
Multi-pass membrane protein
Mol. Mass.:
126672.65
Organism:
Homo sapiens (Human)
Description:
Q12809
Residue:
1159
  
Inhibitor
Name:
BDBM50185775
Synonyms:
7-(1-(2,4-difluorophenethyl)piperazine-4-carbonyl)-1H-indole-3-carbonitrile EMD-281014
Type:
Small organic molecule
Emp. Form.:
C22H20F2N4O
Mol. Mass.:
394.4172
SMILES:
Fc1ccc(CCN2CCN(CC2)C(=O)c2cccc3c(c[nH]c23)C#N)c(F)c1
: