Target
Potassium voltage-gated channel subfamily H member 2
Ligand
BDBM50185783
Substrate
Meas. Tech.
ChEMBL_361717 (CHEMBL861449)
Ki
>9000±n/a nM
Citation
 Ladduwahetty, TBoase, ALMitchinson, AQuin, CPatel, SChapman, KMacLeod, AM A new class of selective, non-basic 5-HT2A receptor antagonists. Bioorg Med Chem Lett 16:3201-4 (2006)  
Target
Name:
Potassium voltage-gated channel subfamily H member 2
Synonyms:
1,3-beta-glucan synthase component GLS2 ERG Eag-related protein 1 Ether-a-go-go-related gene (HERG) Ether-a-go-go-related gene potassium channel 1 Ether-a-go-go-related gene potassium channel 1 (hERG1) Ether-a-go-go-related protein 1 H-ERG KCNH2 Potassium voltage-gated channel subfamily H member 2 (hERG) Voltage-gated potassium channel subunit Kv11.1 hERG Potassium Channel 1 | putative potassium channel subunit
Type:
Multi-pass membrane protein
Mol. Mass.:
126672.65
Organism:
Homo sapiens (Human)
Description:
Q12809
Residue:
1159
  
Inhibitor
Name:
BDBM50185783
Synonyms:
2-(4-(2,4-difluorophenethyl)piperidin-1-ylsulfonyl)benzonitrile | CHEMBL206307
Type:
Small organic molecule
Emp. Form.:
C20H20F2N2O2S
Mol. Mass.:
390.447
SMILES:
Fc1ccc(CCC2CCN(CC2)S(=O)(=O)c2ccccc2C#N)c(F)c1
: