Target
Estrogen receptor
Ligand
BDBM50185837
Substrate
Meas. Tech.
ChEMBL_371967 (CHEMBL852960)
IC50
195±n/a nM
Citation
 Wilkening, RRRatcliffe, RWTynebor, ECWildonger, KJFried, AKHammond, MLMosley, RTFitzgerald, PMSharma, NMcKeever, BMNilsson, SCarlquist, MThorsell, ALocco, LKatz, RFrisch, KBirzin, ETWilkinson, HAMitra, SCai, SHayes, ECSchaeffer, JMRohrer, SP The discovery of tetrahydrofluorenones as a new class of estrogen receptor beta-subtype selective ligands. Bioorg Med Chem Lett 16:3489-94 (2006)  
Target
Name:
Estrogen receptor
Synonyms:
ER ESR ESR1_HUMAN Estrogen receptor Estrogen receptor (ER-alpha) Estrogen receptor alpha (ER) Nuclear receptor subfamily 3 group A member 1
Type:
Protein
Mol. Mass.:
66230.44
Organism:
Homo sapiens (Human)
Description:
P03372
Residue:
595
  
Inhibitor
Name:
BDBM50185837
Synonyms:
7-hydroxy-9a-isobutyl-4-methyl-1,2,9,9a-tetrahydrofluoren-3-one | CHEMBL381298
Type:
Small organic molecule
Emp. Form.:
C18H22O2
Mol. Mass.:
270.3661
SMILES:
CC(C)CC12Cc3cc(O)ccc3C1=C(C)C(=O)CC2
: