Target
C-C chemokine receptor type 5
Ligand
BDBM50185980
Substrate
Meas. Tech.
ChEMBL_351943 (CHEMBL870789)
IC50
5.8±n/a nM
Citation
 Imamura, SIchikawa, TNishikawa, YKanzaki, NTakashima, KNiwa, SIizawa, YBaba, MSugihara, Y Discovery of a piperidine-4-carboxamide CCR5 antagonist (TAK-220) with highly potent Anti-HIV-1 activity. J Med Chem 49:2784-93 (2006)  
Target
Name:
C-C chemokine receptor type 5
Synonyms:
C-C CKR-5 CC-CKR-5 CCR5 CCR5_HUMAN CHEMR13 HIV-1 fusion coreceptor
Type:
Enzyme
Mol. Mass.:
40540.21
Organism:
Homo sapiens (Human)
Description:
P51681
Residue:
352
  
Inhibitor
Name:
BDBM50185980
Synonyms:
CHEMBL207485 | N-{3-[4-(4-carbamoylbenzyl)piperidin-1-yl]propyl}-N-(3,4-dichlorophenyl)-1-(methylsulfonyl)piperidine-4-carboxamide
Type:
Small organic molecule
Emp. Form.:
C29H38Cl2N4O4S
Mol. Mass.:
609.607
SMILES:
CS(=O)(=O)N1CCC(CC1)C(=O)N(CCCN1CCC(Cc2ccc(cc2)C(N)=O)CC1)c1ccc(Cl)c(Cl)c1
: