Target
Histamine H3 receptor
Ligand
BDBM50186270
Substrate
Meas. Tech.
ChEMBL_370711 (CHEMBL867234)
Ki
0.8±n/a nM
Citation
 Jesudason, CDBeavers, LSCramer, JWDill, JFinley, DRLindsley, CWStevens, FCGadski, RAOldham, SWPickard, RTSiedem, CSSindelar, DKSingh, AWatson, BMHipskind, PA Synthesis and SAR of novel histamine H3 receptor antagonists. Bioorg Med Chem Lett 16:3415-8 (2006)  
Target
Name:
Histamine H3 receptor
Synonyms:
HH3R Hrh3
Type:
G Protein-Coupled Receptor (GPCR)
Mol. Mass.:
48607.98
Organism:
Rattus norvegicus (rat)
Description:
Residue:
445
  
Inhibitor
Name:
BDBM50186270
Synonyms:
2-benzyl-7-(3-(piperidin-1-yl)propoxy)-2,3,4,5-tetrahydro-1H-benzo[c]azepine | CHEMBL208611
Type:
Small organic molecule
Emp. Form.:
C25H34N2O
Mol. Mass.:
378.5503
SMILES:
C(COc1ccc2CN(Cc3ccccc3)CCCc2c1)CN1CCCCC1
: