Target
Glycogen synthase kinase-3 beta
Ligand
BDBM50186460
Substrate
Meas. Tech.
ChEMBL_377353 (CHEMBL865426)
IC50
36000±n/a nM
Citation
 Das, JFurch, JALiu, CMoquin, RVLin, JSpergel, SHMcIntyre, KWShuster, DJO'Day, KDPenhallow, BHung, CYDoweyko, AMKamath, AZhang, HMarathe, PKanner, SBLin, TADodd, JHBarrish, JCWityak, J Discovery and SAR of 2-amino-5-(thioaryl)thiazoles as potent and selective Itk inhibitors. Bioorg Med Chem Lett 16:3706-12 (2006)  
Target
Name:
Glycogen synthase kinase-3 beta
Synonyms:
GSK-3 beta GSK3B Glycogen synthase kinase 3 beta (GSK3B) Glycogen synthase kinase-3 beta (GSK-3B) Glycogen synthase kinase-3 beta (GSK3B) Glycogen synthase kinase-3beta (GSK3B) | Serine/threonine-protein kinase GSK3B
Type:
Enzyme
Mol. Mass.:
46756.38
Organism:
Homo sapiens (Human)
Description:
P49841
Residue:
420
  
Inhibitor
Name:
BDBM50186460
Synonyms:
CHEMBL209148 | N-(5-(5-(1-acetylpiperazine-4-carbonyl)-4-methoxy-2-methylphenylthio)thiazol-2-yl)-4-((3,3-dimethylbutan-2-ylamino)methyl)benzamide
Type:
Small organic molecule
Emp. Form.:
C32H41N5O4S2
Mol. Mass.:
623.829
SMILES:
COc1cc(C)c(Sc2cnc(NC(=O)c3ccc(CNC(C)C(C)(C)C)cc3)s2)cc1C(=O)N1CCN(CC1)C(C)=O
: