Target
Proteasome subunit beta type-5
Ligand
BDBM50186721
Substrate
Meas. Tech.
ChEMBL_353294 (CHEMBL861973)
IC50
1.5±n/a nM
Citation
 Rydzewski, RMBurrill, LMendonca, RPalmer, JTRice, MTahilramani, RBass, KELeung, LGjerstad, EJanc, JWPan, L Optimization of subsite binding to the beta5 subunit of the human 20S proteasome using vinyl sulfones and 2-keto-1,3,4-oxadiazoles: syntheses and cellular properties of potent, selective proteasome inhibitors. J Med Chem 49:2953-68 (2006)  
Target
Name:
Proteasome subunit beta type-5
Synonyms:
20S proteasome chymotrypsin-like LMPX PSB5_HUMAN Proteasome Macropain subunit MB1 X
Type:
Protein
Mol. Mass.:
28480.96
Organism:
Homo sapiens (Human)
Description:
Residue:
263
  
Inhibitor
Name:
BDBM50186721
Synonyms:
CHEMBL382203 | Cbz-Ile-NeopentylAsn-Ala-LeuVSMe
Type:
Small organic molecule
Emp. Form.:
C34H55N5O8S
Mol. Mass.:
693.894
SMILES:
CC[C@H](C)[C@H](NC(=O)OCc1ccccc1)C(=O)N[C@@H](CC(=O)NCC(C)(C)C)C(=O)N[C@@H](C)C(=O)N[C@@H](CC(C)C)C=CS(C)(=O)=O
: