Target
Melanin-concentrating hormone receptor 2
Ligand
BDBM50186807
Substrate
Meas. Tech.
ChEMBL_376789 (CHEMBL866614)
Ki
>3000±n/a nM
Citation
 Wu, WLBurnett, DASpring, RQiang, LSasikumar, TKDomalski, MSGreenlee, WJO'Neill, KHawes, BE Synthesis and structure-activity relationships of piperidine-based melanin-concentrating hormone receptor 1 antagonists. Bioorg Med Chem Lett 16:3668-73 (2006)  
Target
Name:
Melanin-concentrating hormone receptor 2
Synonyms:
GPR145 MCHR2_HUMAN Melanin-concentrating hormone receptor SLT
Type:
Enzyme Catalytic Domain
Mol. Mass.:
38862.16
Organism:
Homo sapiens (Human)
Description:
Melanin Concentrating Hormone 2 GPR145 HUMAN::Q969V1
Residue:
340
  
Inhibitor
Name:
BDBM50186807
Synonyms:
3-[4-(3'-cyano-biphenyl-4-yl)-1-diethylsulfamoyl-piperidin-4-yl]-N-(3,4-difluoro-phenyl)-propionamide | CHEMBL212671
Type:
Small organic molecule
Emp. Form.:
C31H34F2N4O3S
Mol. Mass.:
580.688
SMILES:
CCN(CC)S(=O)(=O)N1CCC(CCC(=O)Nc2ccc(F)c(F)c2)(CC1)c1ccc(cc1)-c1cccc(c1)C#N
: