Target
5-hydroxytryptamine receptor 6
Ligand
BDBM50187073
Substrate
Meas. Tech.
ChEMBL_375580 (CHEMBL871427)
Ki
210±n/a nM
Citation
 Siripurapu, UKolanos, RDukat, MRoth, BLGlennon, RA Binding of methoxy-substituted N1-benzenesulfonylindole analogs at human 5-HT6 serotonin receptors. Bioorg Med Chem Lett 16:3793-6 (2006)  
Target
Name:
5-hydroxytryptamine receptor 6
Synonyms:
5-HT-6 5-hydroxytryptamine receptor 6 (5-HT-6) 5-hydroxytryptamine receptor 6 (5HT6) HTR6 Serotonin 6 (5-HT6) receptor | Serotonin Receptor 6
Type:
G Protein-Coupled Receptor (GPCR)
Mol. Mass.:
46968.43
Organism:
Homo sapiens (Human)
Description:
P50406
Residue:
440
  
Inhibitor
Name:
BDBM50187073
Synonyms:
4-(2,4-dimethoxy-5,6,7,8-tetrahydrocarbazol-9-ylsulfonyl)benzenamine | CHEMBL377546
Type:
Small organic molecule
Emp. Form.:
C20H22N2O4S
Mol. Mass.:
386.465
SMILES:
COc1cc(OC)c2c3CCCCc3n(c2c1)S(=O)(=O)c1ccc(N)cc1
: