Target
Vascular endothelial growth factor receptor 2
Ligand
BDBM50188290
Substrate
Meas. Tech.
ChEMBL_380316 (CHEMBL864892)
IC50
600±n/a nM
Citation
 Dinges, JAkritopoulou-Zanze, IArnold, LDBarlozzari, TBousquet, PFCunha, GAEricsson, AMIwasaki, NMichaelides, MROgawa, NPhelan, KMRafferty, PSowin, TJStewart, KDTokuyama, RXia, ZZhang, HQ Hit-to-lead optimization of 1,4-dihydroindeno[1,2-c]pyrazoles as a novel class of KDR kinase inhibitors. Bioorg Med Chem Lett 16:4371-5 (2006)  
Target
Name:
Vascular endothelial growth factor receptor 2
Synonyms:
CD_antigen=CD309 Fetal liver kinase 1 (FLK-1) KDR Protein-tyrosine kinase receptor Flk-1 VEGFR-2 VEGFR2 Vascular Endothelial Growth Factor Receptor Kinase 2 Vascular endothelial growth factor receptor 2 (KDR) Vascular endothelial growth factor receptor 2 (VEGFR2) Vascular endothelial growth factor receptor-2 (VEGFR-2)
Type:
Receptor Tyrosine Kinase
Mol. Mass.:
151510.97
Organism:
Homo sapiens (Human)
Description:
P35968
Residue:
1356
  
Inhibitor
Name:
BDBM50188290
Synonyms:
7-((4-methylpiperazin-1-yl)methyl)-3-phenyl-1,4-dihydroindeno[1,2-c]pyrazole | CHEMBL427050
Type:
Small organic molecule
Emp. Form.:
C22H24N4
Mol. Mass.:
344.4528
SMILES:
CN1CCN(Cc2ccc3Cc4c([nH]nc4-c4ccccc4)-c3c2)CC1
: