Target
Carbonic anhydrase 9
Ligand
BDBM50188774
Substrate
Meas. Tech.
ChEMBL_390421 (CHEMBL869846)
Ki
540±n/a nM
Citation
 Temperini, CInnocenti, AScozzafava, ASupuran, CT N-hydroxyurea--a versatile zinc binding function in the design of metalloenzyme inhibitors. Bioorg Med Chem Lett 16:4316-20 (2006)  
Target
Name:
Carbonic anhydrase 9
Synonyms:
CA-IX CAH9_HUMAN Carbonic anhydrase 9 (CA IX) Carbonic anhydrase 9 precursor Carbonic anhydrase IX (CAIX) Carbonic anhydrases; II & IX MN RCC-associated antigen G250
Type:
Enzyme
Mol. Mass.:
49669.03
Organism:
Homo sapiens (Human)
Description:
Catalytic domain of human cloned isozyme was used in the assay
Residue:
459
  
Inhibitor
Name:
BDBM50188774
Synonyms:
1-(3,4-dichlorophenyl)-3-hydroxyurea | CHEMBL213348
Type:
Small organic molecule
Emp. Form.:
C7H6Cl2N2O2
Mol. Mass.:
221.041
SMILES:
ONC(=O)Nc1ccc(Cl)c(Cl)c1
: