Target
Adenosine receptor A3
Ligand
BDBM50190448
Substrate
Meas. Tech.
ChEMBL_375257 (CHEMBL867484)
Ki
194±n/a nM
Citation
 Tafi, ABernardini, CBotta, MCorelli, FAndreini, MMartinelli, AOrtore, GBaraldi, PGFruttarolo, FBorea, PATuccinardi, T Pharmacophore based receptor modeling: the case of adenosine A3 receptor antagonists. An approach to the optimization of protein models. J Med Chem 49:4085-97 (2006)  
Target
Name:
Adenosine receptor A3
Synonyms:
A3 adenosine receptor (hA3) ADORA3 | Adenosine A3 receptor (A3AR)
Type:
G Protein-Coupled Receptor (GPCR)
Mol. Mass.:
36197.32
Organism:
Homo sapiens (Human)
Description:
P0DMS8
Residue:
318
  
Inhibitor
Name:
BDBM50190448
Synonyms:
5-Ethylsulfanylcarbonyl-6-methyl-2-phenyl-4-propyl-nicotinic acid ethyl ester ethyl 5-(ethylthiocarbonyl)-6-methyl-2-phenyl-4-propylnicotinate
Type:
Small organic molecule
Emp. Form.:
C21H25NO3S
Mol. Mass.:
371.493
SMILES:
CCCc1c(C(=O)SCC)c(C)nc(-c2ccccc2)c1C(=O)OCC
: