Target
Adenosine receptor A3
Ligand
BDBM50190453
Substrate
Meas. Tech.
ChEMBL_375257 (CHEMBL867484)
Ki
20±n/a nM
Citation
 Tafi, ABernardini, CBotta, MCorelli, FAndreini, MMartinelli, AOrtore, GBaraldi, PGFruttarolo, FBorea, PATuccinardi, T Pharmacophore based receptor modeling: the case of adenosine A3 receptor antagonists. An approach to the optimization of protein models. J Med Chem 49:4085-97 (2006)  
Target
Name:
Adenosine receptor A3
Synonyms:
A3 adenosine receptor (hA3) ADORA3 | Adenosine A3 receptor (A3AR)
Type:
G Protein-Coupled Receptor (GPCR)
Mol. Mass.:
36197.32
Organism:
Homo sapiens (Human)
Description:
P0DMS8
Residue:
318
  
Inhibitor
Name:
BDBM50190453
Synonyms:
CHEMBL377271 | ethyl 5-(ethylthiocarbonyl)-4,6-dimethyl-2-phenylnicotinate
Type:
Small organic molecule
Emp. Form.:
C19H21NO3S
Mol. Mass.:
343.44
SMILES:
CCOC(=O)c1c(C)c(C(=O)SCC)c(C)nc1-c1ccccc1
: