Target
Adenosine receptor A3
Ligand
BDBM50088473
Substrate
Meas. Tech.
ChEMBL_375257 (CHEMBL867484)
Ki
82±n/a nM
Citation
 Tafi, ABernardini, CBotta, MCorelli, FAndreini, MMartinelli, AOrtore, GBaraldi, PGFruttarolo, FBorea, PATuccinardi, T Pharmacophore based receptor modeling: the case of adenosine A3 receptor antagonists. An approach to the optimization of protein models. J Med Chem 49:4085-97 (2006)  
Target
Name:
Adenosine receptor A3
Synonyms:
A3 adenosine receptor (hA3) ADORA3 | Adenosine A3 receptor (A3AR)
Type:
G Protein-Coupled Receptor (GPCR)
Mol. Mass.:
36197.32
Organism:
Homo sapiens (Human)
Description:
P0DMS8
Residue:
318
  
Inhibitor
Name:
BDBM50088473
Synonyms:
1-Phenyl-3-(2-pyrrolidin-1-yl-quinazolin-4-yl)-urea CHEMBL71726
Type:
Small organic molecule
Emp. Form.:
C19H19N5O
Mol. Mass.:
333.3871
SMILES:
O=C(Nc1ccccc1)Nc1nc(nc2ccccc12)N1CCCC1
: