Target
RNA-directed RNA polymerase
Ligand
BDBM50190951
Substrate
Meas. Tech.
ChEMBL_400597 (CHEMBL853550)
IC50
140±n/a nM
Citation
 Li, HTatlock, JLinton, AGonzalez, JBorchardt, ADragovich, PJewell, TPrins, TZhou, RBlazel, JParge, HLove, RHickey, MDoan, CShi, SDuggal, RLewis, CFuhrman, S Identification and structure-based optimization of novel dihydropyrones as potent HCV RNA polymerase inhibitors. Bioorg Med Chem Lett 16:4834-8 (2006)  
Target
Name:
RNA-directed RNA polymerase
Synonyms:
Hepatitis C virus NS5B RNA-dependent RNA polymerase | NS5B protein
Type:
Protein
Mol. Mass.:
25173.95
Organism:
Hepatitis C virus
Description:
Q8JXU8
Residue:
229
  
Inhibitor
Name:
BDBM50190951
Synonyms:
6-(3-chloro-4-methoxyphenethyl)-6-cyclopentyl-4-hydroxy-3-(1-methyl-1H-imidazol-2-ylthio)-5,6-dihydropyran-2-one | CHEMBL217580
Type:
Small organic molecule
Emp. Form.:
C23H27ClN2O4S
Mol. Mass.:
462.989
SMILES:
COc1ccc(CCC2(CC(=O)C(Sc3nccn3C)C(=O)O2)C2CCCC2)cc1Cl
: