Target
Melanocortin receptor 4
Ligand
BDBM50191001
Substrate
Meas. Tech.
ChEMBL_397859 (CHEMBL856320)
Ki
4100±n/a nM
Citation
 Chen, CWTran, JAJiang, WTucci, FCArellano, MWen, JFleck, BAMarinkovic, DWhite, NSPontillo, JSaunders, JMadan, AFoster, ACChen, C Propionylpiperazines as human melanocortin-4 receptor ligands. Bioorg Med Chem Lett 16:4800-3 (2006)  
Target
Name:
Melanocortin receptor 4
Synonyms:
MC4-R MC4R_HUMAN Melanocortin receptor 4 (MC-4) Melanocortin receptor 4 (MC4R)
Type:
Enzyme
Mol. Mass.:
36949.50
Organism:
Homo sapiens (Human)
Description:
P32245
Residue:
332
  
Inhibitor
Name:
BDBM50191001
Synonyms:
(S)-1-(4-(2-(1-amino-3-methylbutyl)-4-(trifluoromethyl)phenyl)piperazin-1-yl)-4-cyclohexylbutan-1-one | CHEMBL215354
Type:
Small organic molecule
Emp. Form.:
C26H40F3N3O
Mol. Mass.:
467.6105
SMILES:
CC(C)C[C@H](N)c1cc(ccc1N1CCN(CC1)C(=O)CCCC1CCCCC1)C(F)(F)F
: