Target
Melanocortin receptor 4
Ligand
BDBM50191019
Substrate
Meas. Tech.
ChEMBL_397859 (CHEMBL856320)
Ki
120±n/a nM
Citation
 Chen, CWTran, JAJiang, WTucci, FCArellano, MWen, JFleck, BAMarinkovic, DWhite, NSPontillo, JSaunders, JMadan, AFoster, ACChen, C Propionylpiperazines as human melanocortin-4 receptor ligands. Bioorg Med Chem Lett 16:4800-3 (2006)  
Target
Name:
Melanocortin receptor 4
Synonyms:
MC4-R MC4R_HUMAN Melanocortin receptor 4 (MC-4) Melanocortin receptor 4 (MC4R)
Type:
Enzyme
Mol. Mass.:
36949.50
Organism:
Homo sapiens (Human)
Description:
P32245
Residue:
332
  
Inhibitor
Name:
BDBM50191019
Synonyms:
1-(4-(2-((S)-1-amino-3-methylbutyl)-4-(trifluoromethyl)phenyl)piperazin-1-yl)-3-(4-methoxyphenyl)-2-methylpropan-1-one | CHEMBL214799
Type:
Small organic molecule
Emp. Form.:
C27H36F3N3O2
Mol. Mass.:
491.5888
SMILES:
COc1ccc(CC(C)C(=O)N2CCN(CC2)c2ccc(cc2[C@@H](N)CC(C)C)C(F)(F)F)cc1
: