Target
Melanocortin receptor 4
Ligand
BDBM50191027
Substrate
Meas. Tech.
ChEMBL_397859 (CHEMBL856320)
Ki
80±n/a nM
Citation
 Chen, CWTran, JAJiang, WTucci, FCArellano, MWen, JFleck, BAMarinkovic, DWhite, NSPontillo, JSaunders, JMadan, AFoster, ACChen, C Propionylpiperazines as human melanocortin-4 receptor ligands. Bioorg Med Chem Lett 16:4800-3 (2006)  
Target
Name:
Melanocortin receptor 4
Synonyms:
MC4-R MC4R_HUMAN Melanocortin receptor 4 (MC-4) Melanocortin receptor 4 (MC4R)
Type:
Enzyme
Mol. Mass.:
36949.50
Organism:
Homo sapiens (Human)
Description:
P32245
Residue:
332
  
Inhibitor
Name:
BDBM50191027
Synonyms:
(R)-1-(4-(2-((S)-1-amino-3-methylbutyl)phenyl)piperazin-1-yl)-3-(4-chlorophenyl)-2-methylpropan-1-one | CHEMBL212779
Type:
Small organic molecule
Emp. Form.:
C25H34ClN3O
Mol. Mass.:
428.01
SMILES:
CC(C)C[C@H](N)c1ccccc1N1CCN(CC1)C(=O)[C@H](C)Cc1ccc(Cl)cc1
: