Target
Sodium/hydrogen exchanger 1
Ligand
BDBM50191832
Substrate
Meas. Tech.
ChEMBL_397780 (CHEMBL856311)
IC50
350±n/a nM
Citation
 Atwal, KSO'Neil, SVAhmad, SDoweyko, LKirby, MDorso, CRChandrasena, GChen, BCZhao, RZahler, R Synthesis and biological activity of 5-aryl-4-(4-(5-methyl-1H-imidazol-4-yl)piperidin-1-yl)pyrimidine analogs as potent, highly selective, and orally bioavailable NHE-1 inhibitors. Bioorg Med Chem Lett 16:4796-9 (2006)  
Target
Name:
Sodium/hydrogen exchanger 1
Synonyms:
APNH NHE-1 Na(+)/H(+) antiporter, amiloride-sensitive SL9A1_HUMAN Solute carrier family 9 member 1
Type:
PROTEIN
Mol. Mass.:
90771.96
Organism:
Homo sapiens (Human)
Description:
ChEMBL_862405
Residue:
815
  
Inhibitor
Name:
BDBM50191832
Synonyms:
5-(3-methoxyphenyl)-4-(4-(4-methyl-1H-imidazol-5-yl)piperidin-1-yl)pyrimidine | CHEMBL450633
Type:
Small organic molecule
Emp. Form.:
C20H23N5O
Mol. Mass.:
349.4295
SMILES:
COc1cccc(c1)-c1cncnc1N1CCC(CC1)c1[nH]cnc1C
: