Target
Delta-type opioid receptor
Ligand
BDBM50194275
Substrate
Meas. Tech.
ChEMBL_393089 (CHEMBL853473)
IC50
10±n/a nM
Citation
 Neumeyer, JLPeng, XKnapp, BIBidlack, JMLazarus, LHSalvadori, STrapella, CBalboni, G New opioid designed multiple ligand from Dmt-Tic and morphinan pharmacophores. J Med Chem 49:5640-3 (2006)  
Target
Name:
Delta-type opioid receptor
Synonyms:
D-OR-1 Delta opioid receptor OPIATE Delta OPRD1 OPRK1 | opioid receptor, delta 1
Type:
G Protein-Coupled Receptor (GPCR)
Mol. Mass.:
40382.98
Organism:
Homo sapiens (Human)
Description:
Competition binding assays were carried out using membrane preparations from transfected HN9.10 cells that constitutively expressed the delta opioid receptor.
Residue:
372
  
Inhibitor
Name:
BDBM50194275
Synonyms:
CHEMBL384915 MCL-451
Type:
Small organic molecule
Emp. Form.:
C24H29N3O5
Mol. Mass.:
439.5042
SMILES:
Cc1cc(O)cc(C)c1C[C@H](N)C(=O)N1Cc2ccccc2C[C@H]1C(=O)NCCC(O)=O
: