Target
Vascular endothelial growth factor receptor 2
Ligand
BDBM14949
Substrate
Meas. Tech.
ChEMBL_396624 (CHEMBL853495)
IC50
2±n/a nM
Citation
 DiMauro, EFNewcomb, JNunes, JJBemis, JEBoucher, CBuchanan, JLBuckner, WHCee, VJChai, LDeak, HLEpstein, LFFaust, TGallant, PGeuns-Meyer, SDGore, AGu, YHenkle, BHodous, BLHsieh, FHuang, XKim, JLLee, JHMartin, MWMasse, CEMcGowan, DCMetz, DMohn, DMorgenstern, KAOliveira-dos-Santos, APatel, VFPowers, DRose, PESchneider, STomlinson, SATudor, YYTurci, SMWelcher, AAWhite, RDZhao, HZhu, LZhu, X Discovery of aminoquinazolines as potent, orally bioavailable inhibitors of Lck: synthesis, SAR, and in vivo anti-inflammatory activity. J Med Chem 49:5671-86 (2006)  
Target
Name:
Vascular endothelial growth factor receptor 2
Synonyms:
CD_antigen=CD309 Fetal liver kinase 1 (FLK-1) KDR Protein-tyrosine kinase receptor Flk-1 VEGFR-2 VEGFR2 Vascular Endothelial Growth Factor Receptor Kinase 2 Vascular endothelial growth factor receptor 2 (KDR) Vascular endothelial growth factor receptor 2 (VEGFR2) Vascular endothelial growth factor receptor-2 (VEGFR-2)
Type:
Receptor Tyrosine Kinase
Mol. Mass.:
151510.97
Organism:
Homo sapiens (Human)
Description:
P35968
Residue:
1356
  
Inhibitor
Name:
BDBM14949
Synonyms:
2-aminoquinazoline 5 CHEMBL385937 | JMC511681 Compound 34
Type:
Small organic molecule
Emp. Form.:
C23H17F3N4O
Mol. Mass.:
422.4025
SMILES:
Cc1ccc(cc1-c1ccc2nc(N)ncc2c1)C(=O)Nc1cccc(c1)C(F)(F)F
: