Target
5-hydroxytryptamine receptor 2A
Ligand
BDBM50194751
Substrate
Meas. Tech.
ChEMBL_399259 (CHEMBL908600)
Ki
47±n/a nM
Citation
 McLean, THParrish, JCBraden, MRMarona-Lewicka, DGallardo-Godoy, ANichols, DE 1-Aminomethylbenzocycloalkanes: conformationally restricted hallucinogenic phenethylamine analogues as functionally selective 5-HT2A receptor agonists. J Med Chem 49:5794-803 (2006)  
Target
Name:
5-hydroxytryptamine receptor 2A
Synonyms:
5-HT-2A 5-HT2A 5-hydroxytryptamine receptor 2A (5HT2A) Htr2 Serotonin Receptor 2A
Type:
G Protein-Coupled Receptor (GPCR)
Mol. Mass.:
52852.05
Organism:
Rattus norvegicus (rat)
Description:
Rat cortex membranes 5-HT2A receptors.
Residue:
471
  
Inhibitor
Name:
BDBM50194751
Synonyms:
C-(5-bromo-4,7-dimethoxyindan-1-yl)methylamine | CHEMBL424890
Type:
Small organic molecule
Emp. Form.:
C12H16BrNO2
Mol. Mass.:
286.165
SMILES:
COc1cc(Br)c(OC)c2CCC(CN)c12
: